Reaction Details
TargetNociceptin receptor
LigandBDBM21842
Substrate/Competitorn/a
Meas. Tech.ChEMBL_144650 (CHEMBL752664)
EC50 4±n/a nM
Citation Jong, LZaveri, NToll, L The design and synthesis of a novel quinolizidine template for potent opioid and opioid receptor-like (ORL1, NOP) receptor ligands. Bioorg Med Chem Lett14:181-5 (2003) Nociceptin receptor
Name:Nociceptin receptor
Type:G Protein-Coupled Receptor (GPCR)
Mol. Mass.:40702.87
Organism:Homo sapiens (Human)
Description:P41146
Residue:370
BDBM21842
NameBDBM21842
Synonyms:(2S)-2-[(2S)-2-[(2S)-2-[(2S)-2-[(2S)-6-amino-2-[(2S)-2-[(2S)-2-[(2S)-2-[(2S)-6-amino-2-[(2S)-2-[(2S)-2-{2-[(2S,3R)-2-[(2S)-2-(2-{2-[(2S)-2-amino-3-phenylpropanamido]acetamido}acetamido)-3-phenylpropanamido]-3-hydroxybutanamido]acetamido}propanamido]-5-carbamimidamidopentanamido]hexanamido]-3-hydroxypropanamido]propanamido]-5-carbamimidamidopentanamido]hexanamido]-4-methylpentanamido]propanamido]butanediamido]-4-carbamoylbutanoic acid OFQ 1-17 Orphanin FQ nociceptin
TypeSmall organic molecule
Emp. Form.C79H129N27O22
Mol. Mass.1809.0373
SMILES[#6]-[#6](-[#6])-[#6]-[#6@H](-[#7]-[#6](=O)-[#6@H](-[#6]-[#6]-[#6]-[#6]-[#7])-[#7]-[#6](=O)-[#6@H](-[#6]-[#6]-[#6]\[#7]=[#6](\[#7])-[#7])-[#7]-[#6](=O)-[#6@H](-[#6])-[#7]-[#6](=O)-[#6@H](-[#6]-[#8])-[#7]-[#6](=O)-[#6@H](-[#6]-[#6]-[#6]-[#6]-[#7])-[#7]-[#6](=O)-[#6@H](-[#6]-[#6]-[#6]\[#7]=[#6](\[#7])-[#7])-[#7]-[#6](=O)-[#6@H](-[#6])-[#7]-[#6](=O)-[#6]-[#7]-[#6](=O)-[#6@@H](-[#7]-[#6](=O)-[#6@H](-[#6]-c1ccccc1)-[#7]-[#6](=O)-[#6]-[#7]-[#6](=O)-[#6]-[#7]-[#6](=O)-[#6@@H](-[#7])-[#6]-c1ccccc1)-[#6@@H](-[#6])-[#8])-[#6](=O)-[#7]-[#6@@H](-[#6])-[#6](=O)-[#7]-[#6@@H](-[#6]-[#6](-[#7])=O)-[#6](=O)-[#7]-[#6@@H](-[#6]-[#6]-[#6](-[#7])=O)-[#6](-[#8])=O