Reaction Details
TargetMu-type opioid receptor
LigandBDBM50137561
Substrate/Competitorn/a
Meas. Tech.ChEMBL_145580 (CHEMBL749656)
EC50>10000±n/a nM
Citation Jong, LZaveri, NToll, L The design and synthesis of a novel quinolizidine template for potent opioid and opioid receptor-like (ORL1, NOP) receptor ligands. Bioorg Med Chem Lett14:181-5 (2003) Mu-type opioid receptor
Name:Mu-type opioid receptor
Type:G Protein-Coupled Receptor (GPCR)
Mol. Mass.:44789.51
Organism:Homo sapiens (Human)
Description:P35372
Residue:400
BDBM50137561
NameBDBM50137561
Synonyms:1-((2S,6S,9aR)-6-Phenyl-octahydro-quinolizin-2-yl)-1,3-dihydro-benzoimidazol-2-one SR-14135
TypeSmall organic molecule
Emp. Form.C22H25N3O
Mol. Mass.347.4534
SMILESO=c1[nH]c2ccccc2n1[C@H]1CCN2[C@H](CCC[C@H]2c2ccccc2)C1