Reaction Details
TargetNociceptin receptor
LigandBDBM50137562
Substrate/Competitorn/a
Meas. Tech.ChEMBL_144660 (CHEMBL752673)
IC50 200±n/a nM
Citation Jong, LZaveri, NToll, L The design and synthesis of a novel quinolizidine template for potent opioid and opioid receptor-like (ORL1, NOP) receptor ligands. Bioorg Med Chem Lett14:181-5 (2003) Nociceptin receptor
Name:Nociceptin receptor
Type:G Protein-Coupled Receptor (GPCR)
Mol. Mass.:40702.87
Organism:Homo sapiens (Human)
Description:P41146
Residue:370
BDBM50137562
NameBDBM50137562
Synonyms:1-(1-Benzyl-piperidin-4-yl)-1,3-dihydro-benzoimidazol-2-one | CHEMBL300616
TypeSmall organic molecule
Emp. Form.C19H21N3O
Mol. Mass.307.3895
SMILESO=c1[nH]c2ccccc2n1C1CCN(Cc2ccccc2)CC1