Reaction Details
TargetKappa-type opioid receptor
LigandBDBM50137568
Substrate/Competitorn/a
Meas. Tech.ChEBML_145249
Ki 227±n/a nM
Citation Jong, LZaveri, NToll, L The design and synthesis of a novel quinolizidine template for potent opioid and opioid receptor-like (ORL1, NOP) receptor ligands. Bioorg Med Chem Lett14:181-5 (2003) Kappa-type opioid receptor
Name:Kappa-type opioid receptor
Type:G Protein-Coupled Receptor (GPCR)
Mol. Mass.:42648.76
Organism:Homo sapiens (Human)
Description:P41145
Residue:380
BDBM50137568
NameBDBM50137568
Synonyms:1-((2S,6S,9aR)-6-Cyclohexyl-octahydro-quinolizin-2-yl)-1,3-dihydro-benzoimidazol-2-one SR-14139
TypeSmall organic molecule
Emp. Form.C22H31N3O
Mol. Mass.353.501
SMILESO=c1[nH]c2ccccc2n1[C@H]1CCN2[C@H](CCC[C@H]2C2CCCCC2)C1