Reaction Details
TargetBeta-secretase 1
LigandBDBM50137699
Substrate/Competitorn/a
Meas. Tech.ChEMBL_41387 (CHEMBL653509)
IC50 37±n/a nM
Citation Chen, SHLamar, JGuo, DKohn, TYang, HCMcGee, JTimm, DErickson, JYip, YMay, PMcCarthy, J P3 cap modified Phe*-Ala series BACE inhibitors. Bioorg Med Chem Lett14:245-50 (2003) Beta-secretase 1
Name:Beta-secretase 1
Type:Protein
Mol. Mass.:55755.10
Organism:Homo sapiens (Human)
Description:P56817
Residue:501
BDBM50137699
NameBDBM50137699
Synonyms:(S)-4-(S)-Hydroxy-5-[(S)-2-((S)-2-hydroxy-3-methyl-butyrylamino)-propionylamino]-2-methyl-6-phenyl-hexanoic acid ((S)-1-benzylcarbamoyl-2-methyl-propyl)-amide | CHEMBL316181
TypeSmall organic molecule
Emp. Form.C33H48N4O6
Mol. Mass.596.7574
SMILESCC(C)[C@H](O)C(=O)N[C@@H](C)C(=O)N[C@@H](Cc1ccccc1)[C@@H](O)C[C@@H](C)C(=O)N[C@@H](C(C)C)C(=O)NCc1ccccc1