Reaction Details
TargetMethionine aminopeptidase 2
LigandBDBM50137403
Substrate/Competitorn/a
Meas. Tech.ChEBML_105146
IC50 0.430000±n/a nM
Citation Pyun, HJFardis, MTario, JYang, CYRuckman, JHenninger, DJin, HKim, CU Investigation of novel fumagillin analogues as angiogenesis inhibitors. Bioorg Med Chem Lett14:91-4 (2003) Methionine aminopeptidase 2
Name:Methionine aminopeptidase 2
Type:Enzyme
Mol. Mass.:52884.45
Organism:Homo sapiens (Human)
Description:P50579
Residue:478
BDBM50137403
NameBDBM50137403
Synonyms:Acetyl-carbamic acid (3R,4S,5S,6R)-5-methoxy-4-[(R)-2-(R)-methyl-3-(3-methyl-but-2-enyl)-oxiranyl]-1-oxa-spiro[2.5]oct-6-yl ester | CHEMBL368349
TypeSmall organic molecule
Emp. Form.C18H26ClNO6
Mol. Mass.387.855
SMILES[#6]-[#8]-[#6@@H]-1-[#6@@H](-[#6]-[#6][C@]2([#6]-[#8]2)[#6@H]-1[C@@]1([#6])[#8]-[#6@@H]1-[#6]\[#6]=[#6](\[#6])-[#6])-[#8]-[#6](=O)-[#7]-[#6](Cl)=O