Reaction Details
TargetMethionine aminopeptidase 2
LigandBDBM50137402
Substrate/Competitorn/a
Meas. Tech.ChEBML_105146
IC50 0.800000±n/a nM
Citation Pyun, HJFardis, MTario, JYang, CYRuckman, JHenninger, DJin, HKim, CU Investigation of novel fumagillin analogues as angiogenesis inhibitors. Bioorg Med Chem Lett14:91-4 (2003) Methionine aminopeptidase 2
Name:Methionine aminopeptidase 2
Type:Enzyme
Mol. Mass.:52884.45
Organism:Homo sapiens (Human)
Description:P50579
Residue:478
BDBM50137402
NameBDBM50137402
Synonyms:4-Ethyl-piperazine-1-carboxylic acid (3R,4S,5S,6R)-4-{1-[(E)-cyclohexylmethoxyimino]-ethyl}-5-methoxy-1-oxa-spiro[2.5]oct-6-yl ester | CHEMBL367938
TypeSmall organic molecule
Emp. Form.C24H41N3O5
Mol. Mass.451.5994
SMILESCCN1CCN(CC1)C(=O)O[C@@H]1CC[C@]2(CO2)[C@H]([C@@H]1OC)C(\C)=N\OCC1CCCCC1