Reaction Details
TargetVoltage-dependent calcium channel subunit alpha-2/delta-1
LigandBDBM50145317
Substrate/Competitorn/a
Meas. Tech.ChEMBL_32525 (CHEMBL641406)
IC50 342±n/a nM
Citation Lebsack, ADGunzner, JWang, BPracitto, RSchaffhauser, HSantini, AAiyar, JBezverkov, RMunoz, BLiu, WVenkatraman, S Identification and synthesis of [1,2,4]triazolo[3,4-a]phthalazine derivatives as high-affinity ligands to the alpha 2 delta-1 subunit of voltage gated calcium channel. Bioorg Med Chem Lett14:2463-7 (2004) 
 
Voltage-dependent calcium channel subunit alpha-2/delta-1
Name:Voltage-dependent calcium channel subunit alpha-2/delta-1
Type:Enzyme
Mol. Mass.:124544.88
Organism:Homo sapiens (Human)
Description:P54289
Residue:1103
BDBM50145317
NameBDBM50145317
Synonyms:CHEMBL81851 | [6-(3-Isopropyl-[1,2,4]triazolo[3,4-a]phthalazin-6-yloxymethyl)-pyridin-2-ylmethyl]-phenethyl-amine
TypeSmall organic molecule
Emp. Form.C27H28N6O
Mol. Mass.452.5508
SMILESCC(C)c1nnc2c3ccccc3c(OCc3cccc(CNCCc4ccccc4)n3)nn12