Reaction Details
TargetVoltage-dependent calcium channel subunit alpha-2/delta-1
LigandBDBM50145325
Substrate/Competitorn/a
Meas. Tech.ChEBML_32525
IC50 700±n/a nM
Citation Lebsack, ADGunzner, JWang, BPracitto, RSchaffhauser, HSantini, AAiyar, JBezverkov, RMunoz, BLiu, WVenkatraman, S Identification and synthesis of [1,2,4]triazolo[3,4-a]phthalazine derivatives as high-affinity ligands to the alpha 2 delta-1 subunit of voltage gated calcium channel. Bioorg Med Chem Lett14:2463-7 (2004) 
 
Voltage-dependent calcium channel subunit alpha-2/delta-1
Name:Voltage-dependent calcium channel subunit alpha-2/delta-1
Type:Enzyme
Mol. Mass.:124544.88
Organism:Homo sapiens (Human)
Description:P54289
Residue:1103
BDBM50145325
NameBDBM50145325
Synonyms:((S)-1-Methyl-2-phenyl-ethyl)-[6-(3-trifluoromethyl-[1,2,4]triazolo[3,4-a]phthalazin-6-yloxymethyl)-pyridin-2-ylmethyl]-amine | CHEMBL79964
TypeSmall organic molecule
Emp. Form.C26H23F3N6O
Mol. Mass.492.4956
SMILESC[C@@H](Cc1ccccc1)NCc1cccc(COc2nn3c(nnc3c3ccccc23)C(F)(F)F)n1