Reaction Details
TargetSodium-dependent serotonin transporter
LigandBDBM50145350
Substrate/Competitorn/a
Meas. Tech.ChEBML_201998
Ki 0.540000±n/a nM
Citation Timms, GHBoot, JRBroadmore, RJCarney, SLCooper, JFindlay, JDGilmore, JMitchell, SMoore, NAPullar, ISanger, GJTomlinson, RTree, BBWedley, S SAR development of a selective 5-HT1D antagonist/serotonin reuptake inhibitor lead using rapid parallel synthesis. Bioorg Med Chem Lett14:2469-72 (2004) 
 
Sodium-dependent serotonin transporter
Name:Sodium-dependent serotonin transporter
Type:Multi-pass membrane protein
Mol. Mass.:70168.43
Organism:Rattus norvegicus (rat)
Description:P31652
Residue:630
BDBM50145350
NameBDBM50145350
Synonyms:1-{2-[4-(6-Fluoro-1-methyl-1H-indazol-3-yl)-3,6-dihydro-2H-pyridin-1-yl]-ethyl}-isochroman-6-carboxylic acid amide | CHEMBL442974
TypeSmall organic molecule
Emp. Form.C25H27FN4O2
Mol. Mass.434.5059
SMILESCn1nc(C2=CCN(CCC3OCCc4cc(ccc34)C(N)=O)CC2)c2ccc(F)cc12