Reaction Details
TargetSodium-dependent serotonin transporter
LigandBDBM50145354
Substrate/Competitorn/a
Meas. Tech.ChEBML_201998
Ki 0.500000±n/a nM
Citation Timms, GHBoot, JRBroadmore, RJCarney, SLCooper, JFindlay, JDGilmore, JMitchell, SMoore, NAPullar, ISanger, GJTomlinson, RTree, BBWedley, S SAR development of a selective 5-HT1D antagonist/serotonin reuptake inhibitor lead using rapid parallel synthesis. Bioorg Med Chem Lett14:2469-72 (2004) 
 
Sodium-dependent serotonin transporter
Name:Sodium-dependent serotonin transporter
Type:Multi-pass membrane protein
Mol. Mass.:70168.43
Organism:Rattus norvegicus (rat)
Description:P31652
Residue:630
BDBM50145354
NameBDBM50145354
Synonyms:1-{2-[4-(6-Fluoro-1H-indazol-3-yl)-3,6-dihydro-2H-pyridin-1-yl]-ethyl}-isochroman-6-carboxylic acid amide | CHEMBL441259
TypeSmall organic molecule
Emp. Form.C24H25FN4O2
Mol. Mass.420.4793
SMILESNC(=O)c1ccc2C(CCN3CCC(=CC3)c3[nH]nc4cc(F)ccc34)OCCc2c1