Reaction Details
TargetVasopressin V2 receptor
LigandBDBM50146302
Substrate/Competitorn/a
Meas. Tech.ChEBML_214260
Ki 12.0±n/a nM
Citation Matthews, JMHoekstra, WJDyatkin, ABHecker, LRHlasta, DJPoulter, BLAndrade-Gordon, Pde Garavilla, LDemarest, KTEricson, EGunnet, JWHageman, WLook, RMoore, JBReynolds, CHMaryanoff, BE Potent nonpeptide vasopressin receptor antagonists based on oxazino- and thiazinobenzodiazepine templates. Bioorg Med Chem Lett14:2747-52 (2004) 
 
Vasopressin V2 receptor
Name:Vasopressin V2 receptor
Type:Receptor
Mol. Mass.:40295.28
Organism:Homo sapiens (Human)
Description:P30518
Residue:371
BDBM50146302
NameBDBM50146302
Synonyms:CHEMBL328079 | N-[3-Chloro-4-((S)-3,4,11,11a-tetrahydro-1H,5H-2-oxa-4a,10-diaza-dibenzo[a,d]cycloheptene-10-carbonyl)-phenyl]-5-fluoro-2-methyl-benzamide
TypeSmall organic molecule
Emp. Form.C27H25ClFN3O3
Mol. Mass.493.957
SMILESCc1ccc(F)cc1C(=O)Nc1ccc(C(=O)N2C[C@H]3COCCN3Cc3ccccc23)c(Cl)c1