Reaction Details
TargetVasopressin V2 receptor
LigandBDBM50146296
Substrate/Competitorn/a
Meas. Tech.ChEMBL_214260 (CHEMBL818586)
Ki 5±n/a nM
Citation Matthews, JMHoekstra, WJDyatkin, ABHecker, LRHlasta, DJPoulter, BLAndrade-Gordon, Pde Garavilla, LDemarest, KTEricson, EGunnet, JWHageman, WLook, RMoore, JBReynolds, CHMaryanoff, BE Potent nonpeptide vasopressin receptor antagonists based on oxazino- and thiazinobenzodiazepine templates. Bioorg Med Chem Lett14:2747-52 (2004) 
 
Vasopressin V2 receptor
Name:Vasopressin V2 receptor
Type:Receptor
Mol. Mass.:40295.28
Organism:Homo sapiens (Human)
Description:P30518
Residue:371
BDBM50146296
NameBDBM50146296
Synonyms:5-Methoxy-biphenyl-2-carboxylic acid [3-chloro-4-((S)-3,4,11,11a-tetrahydro-1H,5H-2-oxa-4a,10-diaza-dibenzo[a,d]cycloheptene-10-carbonyl)-phenyl]-amide | CHEMBL314290
TypeSmall organic molecule
Emp. Form.C33H30ClN3O4
Mol. Mass.568.062
SMILESCOc1ccc(C(=O)Nc2ccc(C(=O)N3C[C@H]4COCCN4Cc4ccccc34)c(Cl)c2)c(c1)-c1ccccc1