Reaction Details
TargetVasopressin V2 receptor
LigandBDBM50146308
Substrate/Competitorn/a
Meas. Tech.ChEMBL_214261 (CHEMBL818587)
Ki 15±n/a nM
Citation Matthews, JMHoekstra, WJDyatkin, ABHecker, LRHlasta, DJPoulter, BLAndrade-Gordon, Pde Garavilla, LDemarest, KTEricson, EGunnet, JWHageman, WLook, RMoore, JBReynolds, CHMaryanoff, BE Potent nonpeptide vasopressin receptor antagonists based on oxazino- and thiazinobenzodiazepine templates. Bioorg Med Chem Lett14:2747-52 (2004) 
 
Vasopressin V2 receptor
Name:Vasopressin V2 receptor
Type:Receptor
Mol. Mass.:40295.28
Organism:Homo sapiens (Human)
Description:P30518
Residue:371
BDBM50146308
NameBDBM50146308
Synonyms:Biphenyl-2-carboxylic acid [3-methoxy-4-(3,4,11,11a-tetrahydro-1H,5H-2-thia-4a,10-diaza-dibenzo[a,d]cycloheptene-10-carbonyl)-phenyl]-amide | CHEMBL93209
TypeSmall organic molecule
Emp. Form.C33H31N3O3S
Mol. Mass.549.683
SMILESCOc1cc(NC(=O)c2ccccc2-c2ccccc2)ccc1C(=O)N1CC2CSCCN2Cc2ccccc12