Reaction Details
TargetVasopressin V2 receptor
LigandBDBM50146311
Substrate/Competitorn/a
Meas. Tech.ChEMBL_214261 (CHEMBL818587)
Ki 11±n/a nM
Citation Matthews, JMHoekstra, WJDyatkin, ABHecker, LRHlasta, DJPoulter, BLAndrade-Gordon, Pde Garavilla, LDemarest, KTEricson, EGunnet, JWHageman, WLook, RMoore, JBReynolds, CHMaryanoff, BE Potent nonpeptide vasopressin receptor antagonists based on oxazino- and thiazinobenzodiazepine templates. Bioorg Med Chem Lett14:2747-52 (2004) 
 
Vasopressin V2 receptor
Name:Vasopressin V2 receptor
Type:Receptor
Mol. Mass.:40295.28
Organism:Homo sapiens (Human)
Description:P30518
Residue:371
BDBM50146311
NameBDBM50146311
Synonyms:4-Fluoro-biphenyl-2-carboxylic acid [3-chloro-4-((S)-3,4,11,11a-tetrahydro-1H,5H-2-oxa-4a,10-diaza-dibenzo[a,d]cycloheptene-10-carbonyl)-phenyl]-amide | CHEMBL94133
TypeSmall organic molecule
Emp. Form.C32H27ClFN3O3
Mol. Mass.556.026
SMILESFc1ccc(-c2ccccc2)c(c1)C(=O)Nc1ccc(C(=O)N2C[C@H]3COCCN3Cc3ccccc23)c(Cl)c1