Reaction Details
TargetPlasmepsin II
LigandBDBM50366908
Substrate/Competitorn/a
Meas. Tech.ChEMBL_154914 (CHEMBL764689)
IC50 9.6±n/a nM
Citation Romeo, SDell'Agli, MParapini, SRizzi, LGalli, GMondani, MSparatore, ATaramelli, DBosisio, E Plasmepsin II inhibition and antiplasmodial activity of Primaquine-Statine 'double-drugs'. Bioorg Med Chem Lett14:2931-4 (2004) 
 
Plasmepsin II
Name:Plasmepsin II
Type:Enzyme
Mol. Mass.:51482.09
Organism:Plasmodium falciparum
Description:P46925
Residue:453
BDBM50366908
NameBDBM50366908
Synonyms:CHEMBL1790772
TypeSmall organic molecule
Emp. Form.C61H91N9O10
Mol. Mass.1110.4295
SMILESCCCCNC(=O)C[C@H](O)[C@H](CC(C)C)NC(=O)[C@@H](NC(=O)c1ccc2cc(ccc2c1)C(=O)OCCCC(=O)N[C@H](CC(C)C)C(=O)N[C@H](CCCCN)C(=O)NCCCC(C)Nc1cc(OC)cc2cccnc12)[C@H](C)CC