Reaction Details
TargetPlasmepsin II
LigandBDBM50366910
Substrate/Competitorn/a
Meas. Tech.ChEMBL_154914 (CHEMBL764689)
IC50 135±n/a nM
Citation Romeo, SDell'Agli, MParapini, SRizzi, LGalli, GMondani, MSparatore, ATaramelli, DBosisio, E Plasmepsin II inhibition and antiplasmodial activity of Primaquine-Statine 'double-drugs'. Bioorg Med Chem Lett14:2931-4 (2004) 
 
Plasmepsin II
Name:Plasmepsin II
Type:Enzyme
Mol. Mass.:51482.09
Organism:Plasmodium falciparum
Description:P46925
Residue:453
BDBM50366910
NameBDBM50366910
Synonyms:CHEMBL1790776
TypeSmall organic molecule
Emp. Form.C55H87N9O8
Mol. Mass.1002.3348
SMILESCCCCNC(=O)C[C@H](O)[C@H](CC(C)C)NC(=O)[C@@H](NC(=O)Cc1ccc(CC(=O)N[C@@H](CC(C)C)C(=O)N[C@@H](CCCCN)C(=O)NCCCC(C)Nc2cc(OC)cc3cccnc23)cc1)[C@H](C)CC