Reaction Details
TargetPlasmepsin II
LigandBDBM50146530
Substrate/Competitorn/a
Meas. Tech.ChEBML_154916
IC50 123±n/a nM
Citation Romeo, SDell'Agli, MParapini, SRizzi, LGalli, GMondani, MSparatore, ATaramelli, DBosisio, E Plasmepsin II inhibition and antiplasmodial activity of Primaquine-Statine 'double-drugs'. Bioorg Med Chem Lett14:2931-4 (2004) 
 
Plasmepsin II
Name:Plasmepsin II
Type:Enzyme
Mol. Mass.:51482.09
Organism:Plasmodium falciparum
Description:P46925
Residue:453
BDBM50146530
NameBDBM50146530
Synonyms:(S)-2-[4-(4-{(S)-1-[(S)-1-((S)-2-Butylcarbamoyl-1-hydroxy-ethyl)-3-methyl-butylcarbamoyl]-2-methyl-butylcarbamoyl}-phenoxy)-benzoylamino]-4-methyl-pentanoic acid | CHEMBL98043
TypeSmall organic molecule
Emp. Form.C38H56N4O8
Mol. Mass.696.8732
SMILESCCCCNC(=O)C[C@H](O)[C@H](CC(C)C)NC(=O)[C@@H](NC(=O)c1ccc(Oc2ccc(cc2)C(=O)N[C@@H](CC(C)C)C(O)=O)cc1)C(C)CC