Reaction Details
TargetSodium- and chloride-dependent creatine transporter 1
LigandBDBM50147112
Substrate/Competitorn/a
Meas. Tech.ChEBML_49277
Ki 200000±n/a nM
Citation Geldenhuys, WJLockman, PRMcAfee, JHFitzpatrick, KTVan der Schyf, CJAllen, DD Molecular modeling studies on the active binding site of the blood-brain barrier choline transporter. Bioorg Med Chem Lett14:3085-92 (2004) 
 
Sodium- and chloride-dependent creatine transporter 1
Name:Sodium- and chloride-dependent creatine transporter 1
Type:PROTEIN
Mol. Mass.:70632.63
Organism:Rattus norvegicus
Description:ChEMBL_49276
Residue:635
BDBM50147112
NameBDBM50147112
Synonyms:2-hydroxy-N,N,N-trimethylpropanaminium CHEMBL107582 | beta-methylcholine
TypeSmall organic molecule
Emp. Form.C6H16NO
Mol. Mass.118.1968
SMILESCC(O)C[N+](C)(C)C