Reaction Details
TargetSodium- and chloride-dependent creatine transporter 1
LigandBDBM50147115
Substrate/Competitorn/a
Meas. Tech.ChEBML_49277
Ki>10000000±n/a nM
Citation Geldenhuys, WJLockman, PRMcAfee, JHFitzpatrick, KTVan der Schyf, CJAllen, DD Molecular modeling studies on the active binding site of the blood-brain barrier choline transporter. Bioorg Med Chem Lett14:3085-92 (2004) 
 
Sodium- and chloride-dependent creatine transporter 1
Name:Sodium- and chloride-dependent creatine transporter 1
Type:PROTEIN
Mol. Mass.:70632.63
Organism:Rattus norvegicus
Description:ChEMBL_49276
Residue:635
BDBM50147115
NameBDBM50147115
Synonyms:((1R,2R)-2-Hydroxy-cyclohexyl)-trimethyl-ammonium | CHEMBL102781
TypeSmall organic molecule
Emp. Form.C9H20NO
Mol. Mass.158.2607
SMILESC[N+](C)(C)[C@@H]1CCCC[C@H]1O