Reaction Details
TargetCarbonic anhydrase 9
LigandBDBM10865
Substrate/Competitorn/a
Meas. Tech.ChEBML_45439
Ki 285±n/a nM
Citation Jaiswal, MKhadikar, PVScozzafava, ASupuran, CT Carbonic anhydrase inhibitors: the first QSAR study on inhibition of tumor-associated isoenzyme IX with aromatic and heterocyclic sulfonamides. Bioorg Med Chem Lett14:3283-90 (2004) 
 
Carbonic anhydrase 9
Name:Carbonic anhydrase 9
Type:Enzyme
Mol. Mass.:49669.03
Organism:Homo sapiens (Human)
Description:Catalytic domain of human cloned isozyme was used in the assay
Residue:459
BDBM10865
NameBDBM10865
Synonyms:4-Amino-3-iodobenzenesulfonamide CHEMBL268177 halogenosulfanilamide deriv. 5e
TypeSmall organic molecule
Emp. Form.C6H7IN2O2S
Mol. Mass.298.101
SMILESNc1ccc(cc1I)S(N)(=O)=O