Reaction Details
TargetExtracellular calcium-sensing receptor
LigandBDBM50404271
Substrate/Competitorn/a
Meas. Tech.ChEMBL_42943 (CHEMBL656309)
EC50 1000±n/a nM
Citation Kessler, AFaure, HPetrel, CRuat, MDauban, PDodd, RH N2-benzyl-N1-(1-(1-naphthyl)ethyl)-3-phenylpropane-1,2-diamines and conformationally restrained indole analogues: development of calindol as a new calcimimetic acting at the calcium sensing receptor. Bioorg Med Chem Lett14:3345-9 (2004) 
 
Extracellular calcium-sensing receptor
Name:Extracellular calcium-sensing receptor
Type:PROTEIN
Mol. Mass.:120858.46
Organism:Rattus norvegicus
Description:ChEMBL_750426
Residue:1079
BDBM50404271
NameBDBM50404271
Synonyms:CHEMBL2092942
TypeSmall organic molecule
Emp. Form.C21H20N2
Mol. Mass.300.3969
SMILESC[C@@H](NCc1cc2ccccc2[nH]1)c1cccc2ccccc12