Reaction Details
TargetCollagenase 3
LigandBDBM50148208
Substrate/Competitorn/a
Meas. Tech.ChEMBL_106600 (CHEMBL717437)
IC50 0.5±n/a nM
Citation Reiter, LARobinson, RPMcClure, KFJones, CSReese, MRMitchell, PGOtterness, IGBliven, MLLiras, JCortina, SRDonahue, KMEskra, JDGriffiths, RJLame, MELopez-Anaya, AMartinelli, GJMcGahee, SMYocum, SALopresti-Morrow, LLTobiassen, LMVaughn-Bowser, ML Pyran-containing sulfonamide hydroxamic acids: potent MMP inhibitors that spare MMP-1. Bioorg Med Chem Lett14:3389-95 (2004) 
 
Collagenase 3
Name:Collagenase 3
Type:Enzyme
Mol. Mass.:53808.06
Organism:Homo sapiens (Human)
Description:P45452
Residue:471
BDBM50148208
NameBDBM50148208
Synonyms:3-[4-(4-Fluoro-phenoxy)-benzenesulfonylamino]-8-oxa-bicyclo[3.2.1]octane-3-carboxylic acid hydroxyamide | CHEMBL321633
TypeSmall organic molecule
Emp. Form.C20H21FN2O6S
Mol. Mass.436.454
SMILESONC(=O)C1(CC2CCC(C1)O2)NS(=O)(=O)c1ccc(Oc2ccc(F)cc2)cc1