Reaction Details
Target72 kDa type IV collagenase
LigandBDBM50148216
Substrate/Competitorn/a
Meas. Tech.ChEMBL_104555 (CHEMBL718941)
IC50 1.6±n/a nM
Citation Reiter, LARobinson, RPMcClure, KFJones, CSReese, MRMitchell, PGOtterness, IGBliven, MLLiras, JCortina, SRDonahue, KMEskra, JDGriffiths, RJLame, MELopez-Anaya, AMartinelli, GJMcGahee, SMYocum, SALopresti-Morrow, LLTobiassen, LMVaughn-Bowser, ML Pyran-containing sulfonamide hydroxamic acids: potent MMP inhibitors that spare MMP-1. Bioorg Med Chem Lett14:3389-95 (2004) 
 
72 kDa type IV collagenase
Name:72 kDa type IV collagenase
Type:Enzyme
Mol. Mass.:73870.36
Organism:Homo sapiens (Human)
Description: P08253
Residue:660
BDBM50148216
NameBDBM50148216
Synonyms:4-[4-(4-Fluoro-phenoxy)-benzenesulfonylamino]-tetrahydro-pyran-4-carboxylic acid hydroxyamide | CHEMBL111856
TypeSmall organic molecule
Emp. Form.C18H19FN2O6S
Mol. Mass.410.417
SMILESONC(=O)C1(CCOCC1)NS(=O)(=O)c1ccc(Oc2ccc(F)cc2)cc1