Reaction Details
TargetEpidermal growth factor receptor
LigandBDBM50122562
Substrate/Competitorn/a
Meas. Tech.ChEMBL_66596 (CHEMBL680027)
IC50 590±n/a nM
Citation Akula, NBhalla, JSridhar, JPattabiraman, N Binding modes of 6,7 di-substituted 4-anilinoquinoline-3-carbonitriles to EGFR. Bioorg Med Chem Lett14:3397-400 (2004) 
 
Epidermal growth factor receptor
Name:Epidermal growth factor receptor
Type:Receptor Kinase Domain
Mol. Mass.:134279.59
Organism:Homo sapiens (Human)
Description:P00533
Residue:1210
BDBM50122562
NameBDBM50122562
Synonyms:CHEMBL281300 | N-[4-(3-Bromo-phenylamino)-3-cyano-quinolin-6-yl]-acrylamide
TypeSmall organic molecule
Emp. Form.C19H13BrN4O
Mol. Mass.393.237
SMILESBrc1cccc(Nc2c(cnc3ccc(NC(=O)C=C)cc23)C#N)c1