Reaction Details
TargetEpidermal growth factor receptor
LigandBDBM50122573
Substrate/Competitorn/a
Meas. Tech.ChEMBL_66596 (CHEMBL680027)
IC50 940±n/a nM
Citation Akula, NBhalla, JSridhar, JPattabiraman, N Binding modes of 6,7 di-substituted 4-anilinoquinoline-3-carbonitriles to EGFR. Bioorg Med Chem Lett14:3397-400 (2004) 
 
Epidermal growth factor receptor
Name:Epidermal growth factor receptor
Type:Receptor Kinase Domain
Mol. Mass.:134279.59
Organism:Homo sapiens (Human)
Description:P00533
Residue:1210
BDBM50122573
NameBDBM50122573
Synonyms:But-2-ynoic acid [4-(3-bromo-phenylamino)-3-cyano-quinolin-6-yl]-amide | CHEMBL283682
TypeSmall organic molecule
Emp. Form.C20H13BrN4O
Mol. Mass.405.247
SMILESCC#CC(=O)Nc1ccc2ncc(C#N)c(Nc3cccc(Br)c3)c2c1