Reaction Details
TargetSphingosine 1-phosphate receptor 2
LigandBDBM50148406
Substrate/Competitorn/a
Meas. Tech.ChEMBL_201322 (CHEMBL806172)
IC50>10000±n/a nM
Citation Hale, JJDoherty, GToth, LLi, ZMills, SGHajdu, RAnn Keohane, CRosenbach, MMilligan, JShei, GJChrebet, GBergstrom, JCard, DRosen, HMandala, S The discovery of 3-(N-alkyl)aminopropylphosphonic acids as potent S1P receptor agonists. Bioorg Med Chem Lett14:3495-9 (2004) 
 
Sphingosine 1-phosphate receptor 2
Name:Sphingosine 1-phosphate receptor 2
Type:G Protein-Coupled Receptor (GPCR)
Mol. Mass.:38883.16
Organism:Homo sapiens (Human)
Description:Membranes isolated from S1P2-transfected CHO cells were used in ligand binding assay.
Residue:353
BDBM50148406
NameBDBM50148406
Synonyms:2,2-Difluoro-4-(4-nonyl-benzylamino)-butyric acid | CHEMBL119516
TypeSmall organic molecule
Emp. Form.C20H31F2NO2
Mol. Mass.355.4624
SMILESCCCCCCCCCc1ccc(CNCCC(F)(F)C(O)=O)cc1