Reaction Details
TargetSphingosine 1-phosphate receptor 4
LigandBDBM50148394
Substrate/Competitorn/a
Meas. Tech.ChEMBL_201448 (CHEMBL873237)
IC50 40±n/a nM
Citation Hale, JJDoherty, GToth, LLi, ZMills, SGHajdu, RAnn Keohane, CRosenbach, MMilligan, JShei, GJChrebet, GBergstrom, JCard, DRosen, HMandala, S The discovery of 3-(N-alkyl)aminopropylphosphonic acids as potent S1P receptor agonists. Bioorg Med Chem Lett14:3495-9 (2004) 
 
Sphingosine 1-phosphate receptor 4
Name:Sphingosine 1-phosphate receptor 4
Type:G Protein-Coupled Receptor (GPCR)
Mol. Mass.:41647.39
Organism:Homo sapiens (Human)
Description:n/a
Residue:384
BDBM50148394
NameBDBM50148394
Synonyms:CHEMBL118860 | [3-(4-Nonyl-benzylamino)-propyl]-phosphonic acid
TypeSmall organic molecule
Emp. Form.C19H34NO3P
Mol. Mass.355.4519
SMILESCCCCCCCCCc1ccc(CNCCCP(O)(O)=O)cc1