Reaction Details
TargetSphingosine 1-phosphate receptor 2
LigandBDBM50148390
Substrate/Competitorn/a
Meas. Tech.ChEBML_201322
IC50 2000±n/a nM
Citation Hale, JJDoherty, GToth, LLi, ZMills, SGHajdu, RAnn Keohane, CRosenbach, MMilligan, JShei, GJChrebet, GBergstrom, JCard, DRosen, HMandala, S The discovery of 3-(N-alkyl)aminopropylphosphonic acids as potent S1P receptor agonists. Bioorg Med Chem Lett14:3495-9 (2004) 
 
Sphingosine 1-phosphate receptor 2
Name:Sphingosine 1-phosphate receptor 2
Type:G Protein-Coupled Receptor (GPCR)
Mol. Mass.:38883.16
Organism:Homo sapiens (Human)
Description:Membranes isolated from S1P2-transfected CHO cells were used in ligand binding assay.
Residue:353
BDBM50148390
NameBDBM50148390
Synonyms:CHEMBL119257 | {3-[4-(4-Heptyl-phenyl)-butylamino]-propyl}-phosphonic acid
TypeSmall organic molecule
Emp. Form.C20H36NO3P
Mol. Mass.369.4785
SMILESCCCCCCCc1ccc(CCCCNCCCP(O)(O)=O)cc1