Reaction Details
TargetSphingosine 1-phosphate receptor 4
LigandBDBM50148395
Substrate/Competitorn/a
Meas. Tech.ChEBML_201448
IC50 1200±n/a nM
Citation Hale, JJDoherty, GToth, LLi, ZMills, SGHajdu, RAnn Keohane, CRosenbach, MMilligan, JShei, GJChrebet, GBergstrom, JCard, DRosen, HMandala, S The discovery of 3-(N-alkyl)aminopropylphosphonic acids as potent S1P receptor agonists. Bioorg Med Chem Lett14:3495-9 (2004) 
 
Sphingosine 1-phosphate receptor 4
Name:Sphingosine 1-phosphate receptor 4
Type:G Protein-Coupled Receptor (GPCR)
Mol. Mass.:41647.39
Organism:Homo sapiens (Human)
Description:n/a
Residue:384
BDBM50148395
NameBDBM50148395
Synonyms:2-Hydroxy-4-(4-nonyl-benzylamino)-butyric acid | CHEMBL118068
TypeSmall organic molecule
Emp. Form.C20H33NO3
Mol. Mass.335.4809
SMILESCCCCCCCCCc1ccc(CNCCC(O)C(O)=O)cc1