Reaction Details
TargetAdenosine receptor A3
LigandBDBM50366923
Substrate/Competitorn/a
Meas. Tech.ChEBML_31701
Ki>10000±n/a nM
Citation Dukat, MTaroua, MDahdouh, ASiripurapu, UDamaj, MIMartin, BRGlennon, RA (+/-)8-Amino-5,6,7,8-tetrahydroisoquinolines as novel antinociceptive agents. Bioorg Med Chem Lett14:3651-4 (2004) 
 
Adenosine receptor A3
Name:Adenosine receptor A3
Type:G Protein-Coupled Receptor (GPCR)
Mol. Mass.:36197.32
Organism:Homo sapiens (Human)
Description:P0DMS8
Residue:318
BDBM50366923
NameBDBM50366923
Synonyms:CHEMBL1794855
TypeSmall organic molecule
Emp. Form.C12H18N2
Mol. Mass.190.2847
SMILESCCN(C)C1CCCc2ccncc12