Reaction Details
TargetMuscarinic acetylcholine receptor M1
LigandBDBM50366923
Substrate/Competitorn/a
Meas. Tech.ChEBML_138401
Ki>10000±n/a nM
Citation Dukat, MTaroua, MDahdouh, ASiripurapu, UDamaj, MIMartin, BRGlennon, RA (+/-)8-Amino-5,6,7,8-tetrahydroisoquinolines as novel antinociceptive agents. Bioorg Med Chem Lett14:3651-4 (2004) 
 
Muscarinic acetylcholine receptor M1
Name:Muscarinic acetylcholine receptor M1
Type:Protein
Mol. Mass.:51442.54
Organism:Homo sapiens (Human)
Description:P11229
Residue:460
BDBM50366923
NameBDBM50366923
Synonyms:CHEMBL1794855
TypeSmall organic molecule
Emp. Form.C12H18N2
Mol. Mass.190.2847
SMILESCCN(C)C1CCCc2ccncc12