Reaction Details
TargetD(4) dopamine receptor
LigandBDBM50366923
Substrate/Competitorn/a
Meas. Tech.ChEBML_63109
Ki>10000±n/a nM
Citation Dukat, MTaroua, MDahdouh, ASiripurapu, UDamaj, MIMartin, BRGlennon, RA (+/-)8-Amino-5,6,7,8-tetrahydroisoquinolines as novel antinociceptive agents. Bioorg Med Chem Lett14:3651-4 (2004) 
 
D(4) dopamine receptor
Name:D(4) dopamine receptor
Type:Enzyme
Mol. Mass.:48373.19
Organism:Homo sapiens (Human)
Description:P21917
Residue:419
BDBM50366923
NameBDBM50366923
Synonyms:CHEMBL1794855
TypeSmall organic molecule
Emp. Form.C12H18N2
Mol. Mass.190.2847
SMILESCCN(C)C1CCCc2ccncc12