Reaction Details
TargetNeuronal acetylcholine receptor subunit alpha-3/beta-4
LigandBDBM50369323
Substrate/Competitorn/a
Meas. Tech.ChEMBL_143410 (CHEMBL750053)
IC50 100±n/a nM
Citation Bergmeier, SCIsmail, KAArason, KMMcKay, SBryant, DLMcKay, DB Structure activity studies of ring E analogues of methyllycaconitine. Part 2: Synthesis of antagonists to the alpha3beta4* nicotinic acetylcholine receptors through modifications to the ester. Bioorg Med Chem Lett14:3739-42 (2004) 
 
Neuronal acetylcholine receptor subunit alpha-3/beta-4
Name:Neuronal acetylcholine receptor subunit alpha-3/beta-4
Type:n/a
Mol. Mass.:n/a
Description:ASSAY_ID of ChEMBL is 1970247
Components:This complex has 2 components.
Component 1
Name:Neuronal acetylcholine receptor subunit beta-4
Synonyms:ACHB4_HUMAN Cholinergic, Nicotinic Alpha6Beta3Beta4Alpha5 Nicotinic acetylcholine receptor alpha6/alpha3/beta4
Type:Enzyme Catalytic Domain
Mol. Mass.:56388.51
Organism:Homo sapiens (Human)
Description:Cholinergic, Nicotinic Alpha6Beta3Beta4Alpha5 0 HUMAN::P30926
Residue:498
Component 2
Name:Neuronal acetylcholine receptor subunit alpha-3
Synonyms:ACHA3_HUMAN Cholinergic, Nicotinic Alpha3Beta2 Cholinergic, Nicotinic Alpha3Beta4x NACHRA3 Neuronal acetylcholine receptor subunit alpha-3 nicotinic central
Type:Enzyme Catalytic Domain
Mol. Mass.:57479.03
Organism:Homo sapiens (Human)
Description:Cholinergic, Nicotinic Alpha3Beta2 0 HUMAN::P32297
Residue:505
BDBM50369323
NameBDBM50369323
Synonyms:MECAMYLAMINE
TypeSmall organic molecule
Emp. Form.C11H21N
Mol. Mass.167.2911
SMILESCN[C@]1(C)[C@@H]2CC[C@@H](C2)C1(C)C