Reaction Details
TargetNeuronal acetylcholine receptor subunit alpha-7
LigandBDBM50149053
Substrate/Competitorn/a
Meas. Tech.ChEBML_144330
IC50 177000±n/a nM
Citation Bergmeier, SCIsmail, KAArason, KMMcKay, SBryant, DLMcKay, DB Structure activity studies of ring E analogues of methyllycaconitine. Part 2: Synthesis of antagonists to the alpha3beta4* nicotinic acetylcholine receptors through modifications to the ester. Bioorg Med Chem Lett14:3739-42 (2004) 
 
Neuronal acetylcholine receptor subunit alpha-7
Name:Neuronal acetylcholine receptor subunit alpha-7
Type:n/a
Mol. Mass.:56448.33
Organism:Homo sapiens (Human)
Description: CHRNA7 (NACHRA7)
Residue:502
BDBM50149053
NameBDBM50149053
Synonyms:2-(3-Methyl-2,5-dioxo-pyrrolidin-1-yl)-benzoic acid 1-phenethyl-piperidin-3-ylmethyl ester | CHEMBL305810
TypeSmall organic molecule
Emp. Form.C26H30N2O4
Mol. Mass.434.5274
SMILESCc1cc(O)n(c1O)-c1ccccc1C(=O)OCC1CCCN(CCc2ccccc2)C1