Reaction Details
TargetAdenosine receptor A1
LigandBDBM50267574
Substrate/Competitorn/a
Meas. Tech.ChEMBL_29580 (CHEMBL640238)
Ki 506±n/a nM
Citation Morrison, CFElzein, EJiang, BIbrahim, PNMarquart, TPalle, VShenk, KDVarkhedkar, VMaa, TWu, LWu, YZeng, DFong, ILustig, DLeung, KZablocki, JA Structure-affinity relationships of 5'-aromatic ethers and 5'-aromatic sulfides as partial A1 adenosine agonists, potential supraventricular anti-arrhythmic agents. Bioorg Med Chem Lett14:3793-7 (2004) 
 
Adenosine receptor A1
Name:Adenosine receptor A1
Type:Enzyme Catalytic Domain
Mol. Mass.:36501.39
Organism:GUINEA PIG
Description:ADENOSINE A1 ADORA1 GUINEA PIG::P47745
Residue:326
BDBM50267574
NameBDBM50267574
Synonyms:CHEMBL489638 | N6-Tetrahydrofuranyl-9H-[5-deoxy-5-(2-fluorophenylthio)-beta-D-ribofuranosyl]adenine
TypeSmall organic molecule
Emp. Form.C20H22FN5O4S
Mol. Mass.447.483
SMILESO[C@@H]1[C@@H](CSc2ccccc2F)O[C@H]([C@@H]1O)n1cnc2c(NC3CCOC3)ncnc12