Reaction Details
TargetAdenosine receptor A1
LigandBDBM50138530
Substrate/Competitorn/a
Meas. Tech.ChEMBL_29280 (CHEMBL640341)
EC50 41±n/a nM
Citation Morrison, CFElzein, EJiang, BIbrahim, PNMarquart, TPalle, VShenk, KDVarkhedkar, VMaa, TWu, LWu, YZeng, DFong, ILustig, DLeung, KZablocki, JA Structure-affinity relationships of 5'-aromatic ethers and 5'-aromatic sulfides as partial A1 adenosine agonists, potential supraventricular anti-arrhythmic agents. Bioorg Med Chem Lett14:3793-7 (2004) 
 
Adenosine receptor A1
Name:Adenosine receptor A1
Type:Enzyme Catalytic Domain
Mol. Mass.:36501.39
Organism:GUINEA PIG
Description:ADENOSINE A1 ADORA1 GUINEA PIG::P47745
Residue:326
BDBM50138530
NameBDBM50138530
Synonyms:(2R,3R,5R)-2-Hydroxymethyl-5-{6-[(R)-(tetrahydro-furan-3-yl)amino]-purin-9-yl}-tetrahydro-furan-3,4-diol BDBM50224766 CVT-510 | Tecadenoson
TypeSmall organic molecule
Emp. Form.C14H19N5O5
Mol. Mass.337.3312
SMILESOC[C@H]1O[C@H]([C@H](O)[C@@H]1O)n1cnc2c(N[C@@H]3CCOC3)ncnc12