Reaction Details
TargetAdenosine receptor A1
LigandBDBM50451986
Substrate/Competitorn/a
Meas. Tech.ChEMBL_29443 (CHEMBL875249)
Ki 192±n/a nM
Citation Morrison, CFElzein, EJiang, BIbrahim, PNMarquart, TPalle, VShenk, KDVarkhedkar, VMaa, TWu, LWu, YZeng, DFong, ILustig, DLeung, KZablocki, JA Structure-affinity relationships of 5'-aromatic ethers and 5'-aromatic sulfides as partial A1 adenosine agonists, potential supraventricular anti-arrhythmic agents. Bioorg Med Chem Lett14:3793-7 (2004) 
 
Adenosine receptor A1
Name:Adenosine receptor A1
Type:Enzyme Catalytic Domain
Mol. Mass.:36501.39
Organism:GUINEA PIG
Description:ADENOSINE A1 ADORA1 GUINEA PIG::P47745
Residue:326
BDBM50451986
NameBDBM50451986
Synonyms:CHEMBL608343
TypeSmall organic molecule
Emp. Form.C19H24N6O6
Mol. Mass.432.4305
SMILESCc1cc(COC[C@H]2OC([C@H](O)[C@@H]2O)n2cnc3c(NC4CCOC4)ncnc23)no1