Reaction Details
TargetAdenosine receptor A1
LigandBDBM50138533
Substrate/Competitorn/a
Meas. Tech.ChEMBL_29575 (CHEMBL640233)
Ki 3612±n/a nM
Citation Morrison, CFElzein, EJiang, BIbrahim, PNMarquart, TPalle, VShenk, KDVarkhedkar, VMaa, TWu, LWu, YZeng, DFong, ILustig, DLeung, KZablocki, JA Structure-affinity relationships of 5'-aromatic ethers and 5'-aromatic sulfides as partial A1 adenosine agonists, potential supraventricular anti-arrhythmic agents. Bioorg Med Chem Lett14:3793-7 (2004) 
 
Adenosine receptor A1
Name:Adenosine receptor A1
Type:Enzyme Catalytic Domain
Mol. Mass.:36501.39
Organism:GUINEA PIG
Description:ADENOSINE A1 ADORA1 GUINEA PIG::P47745
Residue:326
BDBM50138533
NameBDBM50138533
Synonyms:CHEMBL150950 Methyl-carbamic acid (2R,3S,4R)-3,4-dihydroxy-5-{6-[(R)-(tetrahydro-furan-3-yl)amino]-purin-9-yl}-tetrahydro-furan-2-ylmethyl ester
TypeSmall organic molecule
Emp. Form.C16H22N6O6
Mol. Mass.394.3825
SMILESCNC(=O)OC[C@H]1OC([C@H](O)[C@@H]1O)n1cnc2c(NC3CCOC3)ncnc12