Reaction Details
TargetCholecystokinin receptor type A
LigandBDBM50016504
Substrate/Competitorn/a
Meas. Tech.ChEBML_49723
Ki 0.310000±n/a nM
Citation Bellier, BDugave, CEtivant, FGenet, RGigoux, VGarbay, C Synthesis and biological characterisation of [3H]BBL454, a new CCK2 selective radiolabelled agonist displaying original pharmacological properties. Bioorg Med Chem Lett14:369-72 (2003) Cholecystokinin receptor type A
Name:Cholecystokinin receptor type A
Type:n/a
Mol. Mass.:48229.77
Organism:Cavia porcellus
Description:n/a
Residue:430
BDBM50016504
NameBDBM50016504
Synonyms:(S)-3-(2-{[(S)-2-(2-{2-[2-tert-Butoxycarbonylamino-3-((S)-4-sulfooxy-phenyl)-propionylamino]-hexanoylamino}-acetylamino)-3-(1H-indol-3-yl)-propionyl]-methyl-amino}-hexanoylamino)-N-((S)-1-carbamoyl-2-phenyl-ethyl)-succinamic acid Boc-Asp-Tyr(SO3Na)-Nle-Gly-Trp-Nle-Asp-Phe-NH2 CHEMBL428666
TypeSmall organic molecule
Emp. Form.C52H68N9O15S
Mol. Mass.1091.213
SMILESCCCC[C@H](NC(=O)[C@H](Cc1ccc(OS([O-])(=O)=O)cc1)NC(=O)OC(C)(C)C)C(=O)NCC(=O)N[C@@H](Cc1c[nH]c2ccccc12)C(=O)N[C@@H](CCCC)C(=O)N[C@@H](CC(O)=O)C(=O)N[C@@H](Cc1ccccc1)C(N)=O