Reaction Details
TargetLysozyme C-1
LigandBDBM7458
Substrate/Competitorn/a
Meas. Tech.ChEBML_100187
IC50 17700±n/a nM
Citation Ko, HHWeng, JRTsao, LTYen, MHWang, JPLin, CN Anti-inflammatory flavonoids and pterocarpanoid from Crotalaria pallida and C. assamica. Bioorg Med Chem Lett14:1011-4 (2004) 
 
Lysozyme C-1
Name:Lysozyme C-1
Type:PROTEIN
Mol. Mass.:16739.00
Organism:Rattus norvegicus
Description:ChEMBL_12136
Residue:148
BDBM7458
NameBDBM7458
Synonyms:5,7-dihydroxy-2-(4-hydroxyphenyl)-4H-chromen-4-one Apigenin Apigenin (3) Apigenin, 13 Naringenin, 18 US11337935, Compound Apigenin cid_5280443 | jm5b01461, Compound 90
TypeSmall organic molecule
Emp. Form.C15H10O5
Mol. Mass.270.2369
SMILESOc1ccc(cc1)-c1cc(=O)c2c(O)cc(O)cc2o1