Reaction Details
TargetLysozyme C-1
LigandBDBM50142193
Substrate/Competitorn/a
Meas. Tech.ChEBML_100187
IC50 26300±n/a nM
Citation Ko, HHWeng, JRTsao, LTYen, MHWang, JPLin, CN Anti-inflammatory flavonoids and pterocarpanoid from Crotalaria pallida and C. assamica. Bioorg Med Chem Lett14:1011-4 (2004) 
 
Lysozyme C-1
Name:Lysozyme C-1
Type:PROTEIN
Mol. Mass.:16739.00
Organism:Rattus norvegicus
Description:ChEMBL_12136
Residue:148
BDBM50142193
NameBDBM50142193
Synonyms:2'-hydroxydaidzein 3-(2,4-dihydroxyphenyl)-7-hydroxy-4H-chromen-4-one CHEMBL6694
TypeSmall organic molecule
Emp. Form.C15H10O5
Mol. Mass.270.2369
SMILESOc1ccc(c(O)c1)-c1coc2cc(O)ccc2c1=O