Reaction Details
TargetLysozyme C-1
LigandBDBM50142191
Substrate/Competitorn/a
Meas. Tech.ChEBML_100187
IC50>30000±n/a nM
Citation Ko, HHWeng, JRTsao, LTYen, MHWang, JPLin, CN Anti-inflammatory flavonoids and pterocarpanoid from Crotalaria pallida and C. assamica. Bioorg Med Chem Lett14:1011-4 (2004) 
 
Lysozyme C-1
Name:Lysozyme C-1
Type:PROTEIN
Mol. Mass.:16739.00
Organism:Rattus norvegicus
Description:ChEMBL_12136
Residue:148
BDBM50142191
NameBDBM50142191
Synonyms:5,7-Dihydroxy-3-(4-hydroxy-2-methoxy-phenyl)-chromen-4-one theralin
TypeSmall organic molecule
Emp. Form.C16H12O6
Mol. Mass.300.2629
SMILESCOc1cc(O)ccc1-c1coc2cc(O)cc(O)c2c1=O