Reaction Details
TargetCalpain-1 catalytic subunit
LigandBDBM50142284
Substrate/Competitorn/a
Meas. Tech.ChEMBL_43660 (CHEMBL654086)
IC50 2.1±n/a nM
Citation Bihovsky, RTao, MMallamo, JPWells, GJ 1,2-Benzothiazine 1,1-dioxide alpha-ketoamide analogues as potent calpain I inhibitors. Bioorg Med Chem Lett14:1035-8 (2004) 
 
Calpain-1 catalytic subunit
Name:Calpain-1 catalytic subunit
Type:Protein
Mol. Mass.:81880.51
Organism:Homo sapiens (Human)
Description:n/a
Residue:714
BDBM50142284
NameBDBM50142284
Synonyms:2-Ethyl-1,1-dioxo-1,2,3,4,6,7-hexahydro-5,8-dioxa-1lambda*6*-thia-2-aza-anthracene-3-carboxylic acid ((S)-1-benzyl-2-butylcarbamoyl-2-oxo-ethyl)-amide | CHEMBL8651
TypeSmall organic molecule
Emp. Form.C27H33N3O7S
Mol. Mass.543.632
SMILESCCCCNC(=O)C(=O)[C@H](Cc1ccccc1)NC(=O)C1Cc2cc3OCCOc3cc2S(=O)(=O)N1CC