Reaction Details
TargetMu-type opioid receptor
LigandBDBM50140734
Substrate/Competitorn/a
Meas. Tech.ChEBML_148227
Ki 426±n/a nM
Citation Chen, ZGoehring, RRValenzano, KJKyle, DJ Design and synthesis of novel small molecule N/OFQ receptor antagonists. Bioorg Med Chem Lett14:1347-51 (2004) 
 
Mu-type opioid receptor
Name:Mu-type opioid receptor
Type:G Protein-Coupled Receptor (GPCR)
Mol. Mass.:44789.51
Organism:Homo sapiens (Human)
Description:P35372
Residue:400
BDBM50140734
NameBDBM50140734
Synonyms:(3aR,7aR)-1-[1-(1,4-Dimethyl-pentyl)-piperidin-4-yl]-octahydro-benzoimidazol-2-one | CHEMBL26909
TypeSmall organic molecule
Emp. Form.C19H35N3O
Mol. Mass.321.5007
SMILESCC(C)CCC(C)N1CCC(CC1)N1[C@@H]2CCCC[C@H]2NC1=O