Reaction Details
TargetMu-type opioid receptor
LigandBDBM50140735
Substrate/Competitorn/a
Meas. Tech.ChEBML_148227
Ki 959±n/a nM
Citation Chen, ZGoehring, RRValenzano, KJKyle, DJ Design and synthesis of novel small molecule N/OFQ receptor antagonists. Bioorg Med Chem Lett14:1347-51 (2004) 
 
Mu-type opioid receptor
Name:Mu-type opioid receptor
Type:G Protein-Coupled Receptor (GPCR)
Mol. Mass.:44789.51
Organism:Homo sapiens (Human)
Description:P35372
Residue:400
BDBM50140735
NameBDBM50140735
Synonyms:(3aR,7aR)-1-[1-(4-Isopropyl-cyclohexyl)-piperidin-4-yl]-octahydro-benzoimidazol-2-one | CHEMBL286411
TypeSmall organic molecule
Emp. Form.C21H37N3O
Mol. Mass.347.538
SMILESCC(C)C1CCC(CC1)N1CCC(CC1)N1[C@@H]2CCCC[C@H]2NC1=O