Reaction Details
TargetMu-type opioid receptor
LigandBDBM50140737
Substrate/Competitorn/a
Meas. Tech.ChEBML_148227
Ki 716±n/a nM
Citation Chen, ZGoehring, RRValenzano, KJKyle, DJ Design and synthesis of novel small molecule N/OFQ receptor antagonists. Bioorg Med Chem Lett14:1347-51 (2004) 
 
Mu-type opioid receptor
Name:Mu-type opioid receptor
Type:G Protein-Coupled Receptor (GPCR)
Mol. Mass.:44789.51
Organism:Homo sapiens (Human)
Description:P35372
Residue:400
BDBM50140737
NameBDBM50140737
Synonyms:(3aR,7aR)-1-(1-Benzyl-piperidin-4-yl)-3-ethyl-octahydro-benzoimidazol-2-one | CHEMBL27018
TypeSmall organic molecule
Emp. Form.C21H31N3O
Mol. Mass.341.4903
SMILESCCN1[C@@H]2CCCC[C@H]2N(C2CCN(Cc3ccccc3)CC2)C1=O