Reaction Details
TargetMu-type opioid receptor
LigandBDBM50140747
Substrate/Competitorn/a
Meas. Tech.ChEBML_148227
Ki 267±n/a nM
Citation Chen, ZGoehring, RRValenzano, KJKyle, DJ Design and synthesis of novel small molecule N/OFQ receptor antagonists. Bioorg Med Chem Lett14:1347-51 (2004) 
 
Mu-type opioid receptor
Name:Mu-type opioid receptor
Type:G Protein-Coupled Receptor (GPCR)
Mol. Mass.:44789.51
Organism:Homo sapiens (Human)
Description:P35372
Residue:400
BDBM50140747
NameBDBM50140747
Synonyms:(3aR,7aR)-1-[1-(3,3-Diphenyl-propyl)-piperidin-4-yl]-3-ethyl-octahydro-benzoimidazol-2-one | CHEMBL418197
TypeSmall organic molecule
Emp. Form.C29H39N3O
Mol. Mass.445.6395
SMILESCCN1[C@@H]2CCCC[C@H]2N(C2CCN(CCC(c3ccccc3)c3ccccc3)CC2)C1=O