Reaction Details
TargetNociceptin receptor
LigandBDBM50140739
Substrate/Competitorn/a
Meas. Tech.ChEBML_144661
Ki 1259±n/a nM
Citation Chen, ZGoehring, RRValenzano, KJKyle, DJ Design and synthesis of novel small molecule N/OFQ receptor antagonists. Bioorg Med Chem Lett14:1347-51 (2004) 
 
Nociceptin receptor
Name:Nociceptin receptor
Type:G Protein-Coupled Receptor (GPCR)
Mol. Mass.:40702.87
Organism:Homo sapiens (Human)
Description:P41146
Residue:370
BDBM50140739
NameBDBM50140739
Synonyms:(3aR,7aR)-1-(1-Naphthalen-2-ylmethyl-piperidin-4-yl)-octahydro-benzoimidazol-2-one | CHEMBL29571
TypeSmall organic molecule
Emp. Form.C23H29N3O
Mol. Mass.363.4959
SMILESO=C1N[C@@H]2CCCC[C@H]2N1C1CCN(Cc2ccc3ccccc3c2)CC1