Reaction Details
TargetMu-type opioid receptor
LigandBDBM50140745
Substrate/Competitorn/a
Meas. Tech.ChEBML_148227
Ki 2165±n/a nM
Citation Chen, ZGoehring, RRValenzano, KJKyle, DJ Design and synthesis of novel small molecule N/OFQ receptor antagonists. Bioorg Med Chem Lett14:1347-51 (2004) 
 
Mu-type opioid receptor
Name:Mu-type opioid receptor
Type:G Protein-Coupled Receptor (GPCR)
Mol. Mass.:44789.51
Organism:Homo sapiens (Human)
Description:P35372
Residue:400
BDBM50140745
NameBDBM50140745
Synonyms:(3aR,7aR)-1-Ethyl-3-[1-(4-propyl-cyclohexyl)-piperidin-4-yl]-octahydro-benzoimidazol-2-one | CHEMBL282376
TypeSmall organic molecule
Emp. Form.C23H41N3O
Mol. Mass.375.5911
SMILESCCCC1CCC(CC1)N1CCC(CC1)N1[C@@H]2CCCC[C@H]2N(CC)C1=O